Clang Error Exit Code 1

Packaging to Android failed: linker command failed with exit code 1

Packaging to Android failed: linker command failed with exit code 1

错误( linker command failed with exit code 1) - 掘金

错误( linker command failed with exit code 1) - 掘金

Creating and Distributing an iOS Binary Framework | Instabug Blog

Creating and Distributing an iOS Binary Framework | Instabug Blog

clang: error: linker command failed with exit c    - 简书

clang: error: linker command failed with exit c - 简书

Xcode - symbol(s) not found for architecture x86_64

Xcode - symbol(s) not found for architecture x86_64

OC-bug: Undefined symbols for architecture i386:

OC-bug: Undefined symbols for architecture i386: "_OBJC_CLASS_$_

linker command failed with exit code 1 - zhoupengju的博客- CSDN博客

linker command failed with exit code 1 - zhoupengju的博客- CSDN博客

Command /Users/Shared/BQSobfuscator4/bin/clang failed with exit code

Command /Users/Shared/BQSobfuscator4/bin/clang failed with exit code

iOS 编译错误: linker command failed with exit code 1 - 小鹏GG丶的

iOS 编译错误: linker command failed with exit code 1 - 小鹏GG丶的

linker command failed with exit code 1 錯誤- IT閱讀

linker command failed with exit code 1 錯誤- IT閱讀

Linker error after updating to Xamarin Mac 7 4 — Xamarin Community

Linker error after updating to Xamarin Mac 7 4 — Xamarin Community

Clang++ exe error linker command failed | Remote build for iOS

Clang++ exe error linker command failed | Remote build for iOS

Linker command failed with exit code1 · Issue #315 · firebase

Linker command failed with exit code1 · Issue #315 · firebase

coco2dx新建项目报错,ld: -pie can only be used when targeting iOS

coco2dx新建项目报错,ld: -pie can only be used when targeting iOS

Can't Build OR Buld and Deploy to iOS in Telerik AppBuilder

Can't Build OR Buld and Deploy to iOS in Telerik AppBuilder

clang: error: linker command failed with exit code 1 (use -v to see

clang: error: linker command failed with exit code 1 (use -v to see

打包错误clang: error: linker command failed with ex    - 简书

打包错误clang: error: linker command failed with ex - 简书

svn中第一次check out working copy项目下来出现ld: library not found

svn中第一次check out working copy项目下来出现ld: library not found

I consistently run into this clang error: linker problem using C++

I consistently run into this clang error: linker problem using C++

Visa iOS SDK not compatible with Swift 3 0 - Visa Developer Community

Visa iOS SDK not compatible with Swift 3 0 - Visa Developer Community

Xcodeでのエラーについて - C・C++・C# 解決済み| 【OKWAVE】

Xcodeでのエラーについて - C・C++・C# 解決済み| 【OKWAVE】

集成极光推送时出错clang: error: linker command failed with exit code

集成极光推送时出错clang: error: linker command failed with exit code

ld: 16 duplicate symbols for architecture i386 clang: error: linker

ld: 16 duplicate symbols for architecture i386 clang: error: linker

Migrating Perfect project to Swift 4 - By

Migrating Perfect project to Swift 4 - By

New: Diagnostics of Solutions in C++ - Codeforces

New: Diagnostics of Solutions in C++ - Codeforces

arm64 linker error | Vuforia Developer Portal

arm64 linker error | Vuforia Developer Portal

Directories and library not found in Xcode

Directories and library not found in Xcode

Screen Sharing SDK linker command failed with exit code 1

Screen Sharing SDK linker command failed with exit code 1

swift - Xcode 10 Beta 5 — clang: error: linker command failed with

swift - Xcode 10 Beta 5 — clang: error: linker command failed with

Xcode 10 upgrade error: clang: error: linker command failed with

Xcode 10 upgrade error: clang: error: linker command failed with

iPhone5上真機測試問題: Showing Recent Issues clang: error: linker

iPhone5上真機測試問題: Showing Recent Issues clang: error: linker

ZBar bar code reader armv7 error and solution |

ZBar bar code reader armv7 error and solution |

How to compile C++ code with VS Code and cl - 40tude

How to compile C++ code with VS Code and cl - 40tude

ios 编译时报错linker command failed with exit code 1 (use -v to see

ios 编译时报错linker command failed with exit code 1 (use -v to see

出现:clang: error: linker command failed with exit code 1 (use -v

出现:clang: error: linker command failed with exit code 1 (use -v

18367 (wxWidgets make failed on MACOSX 14 2) – wxWidgets

18367 (wxWidgets make failed on MACOSX 14 2) – wxWidgets

Ld Framework Not Found Xcode | Framebob org

Ld Framework Not Found Xcode | Framebob org

Xcode Build Error | Buildbox Official Forum

Xcode Build Error | Buildbox Official Forum

Error on Xcode when trying to Archive an ARFoundation Project from

Error on Xcode when trying to Archive an ARFoundation Project from

Cocos2dx 3 0 and xCode 6 (IOS 8) - cocos2d-x - Cocos Forums

Cocos2dx 3 0 and xCode 6 (IOS 8) - cocos2d-x - Cocos Forums

Continuous integration with Travis CI - Simplify C++!

Continuous integration with Travis CI - Simplify C++!

Unable to build IPA file getting error says

Unable to build IPA file getting error says "Invalid bitcode

creator_to_cocos2dx ios (已解决) 导入为虚拟路径即可 - Cocos2d-x

creator_to_cocos2dx ios (已解决) 导入为虚拟路径即可 - Cocos2d-x

pset3 - Pset 3 - Binary Search - clang: error: linker command failed

pset3 - Pset 3 - Binary Search - clang: error: linker command failed

clang: error: linker command failed with exit code 1 (use -v to see

clang: error: linker command failed with exit code 1 (use -v to see

clang: error: linker command failed with exit code 1 (use -v to see

clang: error: linker command failed with exit code 1 (use -v to see

ld: 411 duplicate symbols for architecture arm64 clang: error

ld: 411 duplicate symbols for architecture arm64 clang: error

Duplicate Symbols For Architecture Arm64 Xcode 9 - Works Best Architects

Duplicate Symbols For Architecture Arm64 Xcode 9 - Works Best Architects

iOS常见错误11:linker command failed with exit code 1 (use&nbs_niki的

iOS常见错误11:linker command failed with exit code 1 (use&nbs_niki的

How do I get rid of the llua lib linking error when I try to add the

How do I get rid of the llua lib linking error when I try to add the

xcode - Компиляция protobuf с Xcode 5 с использованием CocoaPods - Qaru

xcode - Компиляция protobuf с Xcode 5 с использованием CocoaPods - Qaru

Link error building release iOS - MacOSX and iOS - JUCE

Link error building release iOS - MacOSX and iOS - JUCE

Django: macOSでのpip install mysqlclient エラーの解決法 | Yukun's Blog

Django: macOSでのpip install mysqlclient エラーの解決法 | Yukun's Blog

Unity 5 1 - XCode 7 [xcode] clang: error: linker command failed with

Unity 5 1 - XCode 7 [xcode] clang: error: linker command failed with

iOS error:framework not found Bolts for architecture arm64

iOS error:framework not found Bolts for architecture arm64

Xcode编译常见错误解决:linker command failed with exit code 1 (use

Xcode编译常见错误解决:linker command failed with exit code 1 (use

使用个推出现Linker command failed with exit code 1 (use -v to see

使用个推出现Linker command failed with exit code 1 (use -v to see

Enabling the Address Sanitizer | Apple Developer Documentation

Enabling the Address Sanitizer | Apple Developer Documentation

Developers - Can't build release iOS version - error: linker command

Developers - Can't build release iOS version - error: linker command

Building and archiving detached app iOS Mac fails - Help: Expo SDK

Building and archiving detached app iOS Mac fails - Help: Expo SDK

Let's Build Chuck Norris! - Part 8: Using C++ in an iOS application

Let's Build Chuck Norris! - Part 8: Using C++ in an iOS application

CocoaPods third-party library compile time error linker command

CocoaPods third-party library compile time error linker command

Compile or cmake problems - Page 116 - Help and Support - TrinityCore

Compile or cmake problems - Page 116 - Help and Support - TrinityCore

ios - Xcode 5 - clang: error: linker command failed with exit code 1

ios - Xcode 5 - clang: error: linker command failed with exit code 1

簡易的解決方式linker command failed with exit code 1 (use -v to see

簡易的解決方式linker command failed with exit code 1 (use -v to see

Lets learn mobile automation testing - calabash: Calabash IOS

Lets learn mobile automation testing - calabash: Calabash IOS

HOWTO: Setup XCode 6 1 to work with OpenCV3 libraries | Wired Watershed

HOWTO: Setup XCode 6 1 to work with OpenCV3 libraries | Wired Watershed

iOS and Android setup on MacOS - Build Failed when trying to set up

iOS and Android setup on MacOS - Build Failed when trying to set up

SOLVED) - Has this something to do with XCode 7 x ? Can't Publish

SOLVED) - Has this something to do with XCode 7 x ? Can't Publish

ld: framework not found ****** clang: error: linker command failed

ld: framework not found ****** clang: error: linker command failed

Error trying to post my project to Apple with Xcode - Linker command

Error trying to post my project to Apple with Xcode - Linker command

Using WKWebview in iOS9 to Boost Ionic / Cordova Performance

Using WKWebview in iOS9 to Boost Ionic / Cordova Performance

Linking CPLEX to Eclipse IDE for C/C++ (Mars 2) on Mac OS X El

Linking CPLEX to Eclipse IDE for C/C++ (Mars 2) on Mac OS X El

clang: error: linker command failed with exit code 1 (use -v to see

clang: error: linker command failed with exit code 1 (use -v to see

SOLVED]Firebase plugin import error in IOS - SDKBOX - Cocos Forums

SOLVED]Firebase plugin import error in IOS - SDKBOX - Cocos Forums

Symbols not found in architecture + linker command failed with exit

Symbols not found in architecture + linker command failed with exit

Clang++ exe error linker command failed | Remote build for iOS

Clang++ exe error linker command failed | Remote build for iOS

Stay local, let your IDE do remote work for you! | CLion Blog

Stay local, let your IDE do remote work for you! | CLion Blog

clang: error: linker command failed with exit code 1 (use -v to see

clang: error: linker command failed with exit code 1 (use -v to see

IOS AR Build Fails for BP Projects on Preview5 Binary Build - UE4

IOS AR Build Fails for BP Projects on Preview5 Binary Build - UE4

linker command failed with exit code 1 (use -v     - 简书

linker command failed with exit code 1 (use -v - 简书

svn中第一次check out working copy项目下来出现ld: library not found

svn中第一次check out working copy项目下来出现ld: library not found

Compile or cmake problems - Page 112 - Help and Support - TrinityCore

Compile or cmake problems - Page 112 - Help and Support - TrinityCore

Clang exe exited with code 1 | The command [   ] exited with code 1

Clang exe exited with code 1 | The command [ ] exited with code 1

How to Fix linker command failed with exit code 1 (use -v to see

How to Fix linker command failed with exit code 1 (use -v to see

xcode编译错误ld: framework not found UserNotificat    - 简书

xcode编译错误ld: framework not found UserNotificat - 简书

All kinds of errors getting SFML 2 to run in Xcode, would appreciate

All kinds of errors getting SFML 2 to run in Xcode, would appreciate

The new Android Studio/Gradle exporter - Android - JUCE

The new Android Studio/Gradle exporter - Android - JUCE

Static Libraries, Frameworks, and Bitcode - Heitor T  Sergent - Medium

Static Libraries, Frameworks, and Bitcode - Heitor T Sergent - Medium

Ошибка в xcode:

Ошибка в xcode:"clang: error: linker command failed with exit code 1

Xcode 10 upgrade error: clang: error: linker command failed with

Xcode 10 upgrade error: clang: error: linker command failed with

Unity-Technologies / Unity-ARKit-Plugin / Pull request #6: Support

Unity-Technologies / Unity-ARKit-Plugin / Pull request #6: Support